Target
5-hydroxytryptamine receptor 1A
Ligand
BDBM50077658
Substrate
Meas. Tech.
ChEBML_202317
Ki
2.7±n/a nM
Citation
 Ahn, KHLee, SJLee, CHHong, CYPark, TK N-substituted-3-arylpyrrolidines: potent and selective ligands at serotonin 1A receptor. Bioorg Med Chem Lett 9:1379-84 (1999)  
Target
Name:
5-hydroxytryptamine receptor 1A
Synonyms:
5-HT-1A 5-HT1A 5-hydroxytryptamine receptor 1A (5HT1A) 5ht1a Htr1a Serotonin 1a (5-HT1a) receptor/Adrenergic receptor alpha-1 | Serotonin receptor 1A
Type:
G Protein-Coupled Receptor (GPCR)
Mol. Mass.:
46445.29
Organism:
Rattus norvegicus (rat)
Description:
Binding assays were performed using rat hippocampal membranes.
Residue:
422
  
Inhibitor
Name:
BDBM50077658
Synonyms:
1,1-Dioxo-2-[4-(3-phenyl-pyrrolidin-1-yl)-butyl]-1,2-dihydro-1lambda*6*-benzo[d]isothiazol-3-one | CHEMBL28831
Type:
Small organic molecule
Emp. Form.:
C21H24N2O3S
Mol. Mass.:
384.492
SMILES:
O=C1N(CCCCN2CCC(C2)c2ccccc2)S(=O)(=O)c2ccccc12
: