Target
Proteinase-activated receptor 1
Ligand
BDBM50077754
Substrate
Meas. Tech.
ChEBML_209265
EC50
2600±n/a nM
Citation
 McComsey, DFHawkins, MJAndrade-Gordon, PAddo, MFOksenberg, DMaryanoff, BE Heterocycle-peptide hybrid compounds. Aminotriazole-containing agonists of the thrombin receptor (PAR-1). Bioorg Med Chem Lett 9:1423-8 (1999)  
Target
Name:
Proteinase-activated receptor 1
Synonyms:
CF2R F2R PAR1 Proteinase activated receptor 1 TR Thrombin receptor/ Proteinase-activated receptor 1(Par-1)
Type:
Protein
Mol. Mass.:
47450.07
Organism:
Homo sapiens (Human)
Description:
P25116
Residue:
425
  
Inhibitor
Name:
BDBM50077754
Synonyms:
(S)-2-[(S)-3-Cyclohexyl-2-((E)-3-pyridin-3-yl-acryloylamino)-propionylamino]-5-guanidino-pentanoic acid ((S)-1-carbamoyl-2-phenyl-ethyl)-amide | CHEMBL33742
Type:
Small organic molecule
Emp. Form.:
C32H44N8O4
Mol. Mass.:
604.743
SMILES:
NC(=N)NCCC[C@H](NC(=O)[C@H](CC1CCCCC1)NC(=O)C=Cc1cccnc1)C(=O)N[C@@H](Cc1ccccc1)C(N)=O
: