Target
Thymidylate synthase
Ligand
BDBM50077838
Substrate
Meas. Tech.
ChEMBL_209135 (CHEMBL814653)
Ki
1500±n/a nM
Citation
 Costi, PMRinaldi, MTondi, DPecorari, PBarlocco, DGhelli, SStroud, RMSanti, DVStout, TJMusiu, CMarangiu, EMPani, ACongiu, DLoi, GALa Colla, P Phthalein derivatives as a new tool for selectivity in thymidylate synthase inhibition. J Med Chem 42:2112-24 (1999)  
Target
Name:
Thymidylate synthase
Synonyms:
TS TYSY_ECOLI thyA
Type:
Enzyme
Mol. Mass.:
30475.81
Organism:
Escherichia coli
Description:
Residue:
264
  
Inhibitor
Name:
BDBM50077838
Synonyms:
3,3-Bis-(3-fluoro-4-hydroxy-phenyl)-3H-naphtho[2,3-c]furan-1-one | CHEMBL308680
Type:
Small organic molecule
Emp. Form.:
C24H14F2O4
Mol. Mass.:
404.3624
SMILES:
Oc1ccc(cc1F)C1(OC(=O)c2cc3ccccc3cc12)c1ccc(O)c(F)c1
: