Target
Thymidylate synthase
Ligand
BDBM50077847
Substrate
Meas. Tech.
ChEMBL_209135 (CHEMBL814653)
Ki
1500±n/a nM
Citation
 Costi, PMRinaldi, MTondi, DPecorari, PBarlocco, DGhelli, SStroud, RMSanti, DVStout, TJMusiu, CMarangiu, EMPani, ACongiu, DLoi, GALa Colla, P Phthalein derivatives as a new tool for selectivity in thymidylate synthase inhibition. J Med Chem 42:2112-24 (1999)  
Target
Name:
Thymidylate synthase
Synonyms:
TS TYSY_ECOLI thyA
Type:
Enzyme
Mol. Mass.:
30475.81
Organism:
Escherichia coli
Description:
Residue:
264
  
Inhibitor
Name:
BDBM50077847
Synonyms:
3-(4-Hydroxy-naphthalen-1-yl)-3-(4-hydroxy-phenyl)-3H-isobenzofuran-1-one | CHEMBL63528
Type:
Small organic molecule
Emp. Form.:
C24H16O4
Mol. Mass.:
368.3814
SMILES:
Oc1ccc(cc1)C1(OC(=O)c2ccccc12)c1ccc(O)c2ccccc12
: