Target
Carbonic anhydrase 2
Ligand
BDBM50523344
Substrate
Meas. Tech.
ChEMBL_1890033 (CHEMBL4391787)
Ki
0.080000±n/a nM
Citation
 Krasavin, MShetnev, ABaykov, SKalinin, SNocentini, ASharoyko, VPoli, GTuccinardi, TKorsakov, MTennikova, TBSupuran, CT Pyridazinone-substituted benzenesulfonamides display potent inhibition of membrane-bound human carbonic anhydrase IX and promising antiproliferative activity against cancer cell lines. Eur J Med Chem 168:301-314 (2019)  
Target
Name:
Carbonic anhydrase 2
Synonyms:
CA-II CAC Carbonate dehydratase II Carbonic anhydrase 2 (CA-II) Carbonic anhydrase C Carbonic anhydrase II (CA-II) Carbonic anhydrase II (hCA II) | Carbonic anhydrase isoenzyme II (hCA II)
Type:
Enzyme
Mol. Mass.:
29250.71
Organism:
Homo sapiens (Human)
Description:
P00918
Residue:
260
  
Inhibitor
Name:
BDBM50523344
Synonyms:
CHEMBL4566532
Type:
Small organic molecule
Emp. Form.:
C16H20N4O3S
Mol. Mass.:
348.42
SMILES:
NS(=O)(=O)c1ccc(cc1)-n1ncc(cc1=O)N1CCCCCC1
: