Target
Carbonic anhydrase 2
Ligand
BDBM50523348
Substrate
Meas. Tech.
ChEMBL_1890033 (CHEMBL4391787)
Ki
0.080000±n/a nM
Citation
 Krasavin, MShetnev, ABaykov, SKalinin, SNocentini, ASharoyko, VPoli, GTuccinardi, TKorsakov, MTennikova, TBSupuran, CT Pyridazinone-substituted benzenesulfonamides display potent inhibition of membrane-bound human carbonic anhydrase IX and promising antiproliferative activity against cancer cell lines. Eur J Med Chem 168:301-314 (2019)  
Target
Name:
Carbonic anhydrase 2
Synonyms:
CA-II CAC Carbonate dehydratase II Carbonic anhydrase 2 (CA-II) Carbonic anhydrase C Carbonic anhydrase II (CA-II) Carbonic anhydrase II (hCA II) | Carbonic anhydrase isoenzyme II (hCA II)
Type:
Enzyme
Mol. Mass.:
29250.71
Organism:
Homo sapiens (Human)
Description:
P00918
Residue:
260
  
Inhibitor
Name:
BDBM50523348
Synonyms:
CHEMBL4519564
Type:
Small organic molecule
Emp. Form.:
C17H17N3O4S
Mol. Mass.:
359.4
SMILES:
COc1ccc(cc1)C1=NN(C(=O)CC1)c1ccc(cc1)S(N)(=O)=O
: