Target
Xaa-Pro aminopeptidase 1
Ligand
BDBM50078397
Substrate
Meas. Tech.
ChEMBL_35519 (CHEMBL644752)
IC50
6300±n/a nM
Citation
 Maggiora, LLOrawski, ATSimmons, WH Apstatin analogue inhibitors of aminopeptidase P, a bradykinin-degrading enzyme. J Med Chem 42:2394-402 (1999)  
Target
Name:
Xaa-Pro aminopeptidase 1
Synonyms:
Aminoacylproline aminopeptidase Soluble aminopeptidase P X-prolyl aminopeptidase 1, soluble XPNPEPL XPP1_HUMAN | sAmp
Type:
PROTEIN
Mol. Mass.:
69905.93
Organism:
Homo sapiens (Human)
Description:
ChEMBL_461054
Residue:
623
  
Inhibitor
Name:
BDBM50078397
Synonyms:
1-(3-Amino-2-hydroxy-5-methyl-hexanoyl)-pyrrolidine-2-carboxylic acid (1-carbamoyl-ethyl)-amide | CHEMBL420207
Type:
Small organic molecule
Emp. Form.:
C15H28N4O4
Mol. Mass.:
328.4072
SMILES:
CC(C)C[C@@H](N)C(O)C(=O)N1CCC[C@H]1C(=O)N[C@@H](C)C(N)=O
: