Target
Bifunctional dihydrofolate reductase-thymidylate synthase
Ligand
BDBM50029766
Substrate
Meas. Tech.
ChEMBL_53316 (CHEMBL665700)
IC50
0.85±n/a nM
Citation
 Gangjee, AAdair, OQueener, SF Pneumocystis carinii and Toxoplasma gondii dihydrofolate reductase inhibitors and antitumor agents: synthesis and biological activities of 2,4-diamino-5-methyl-6-[(monosubstituted anilino)methyl] pyrido[2,3-d]pyrimidines. J Med Chem 42:2447-55 (1999)  
Target
Name:
Bifunctional dihydrofolate reductase-thymidylate synthase
Synonyms:
DHFR-TS Dihydrofolate reductase Dihydrofolate reductase; T. gondii vs rat
Type:
Enzyme
Mol. Mass.:
68757.49
Organism:
Toxoplasma gondii
Description:
Q07422
Residue:
610
  
Inhibitor
Name:
BDBM50029766
Synonyms:
2,4-DIAMINO-5-METHYL-6-[(3,4,5-TRIMETHOXY-N-METHYLANILINO)METHYL]PYRIDO[2,3-D]PYRIMIDINE CHEMBL50514
Type:
Small organic molecule
Emp. Form.:
C19H24N6O3
Mol. Mass.:
384.4323
SMILES:
COc1cc(cc(OC)c1OC)N(C)Cc1cnc2nc(N)nc(N)c2c1C
: