Target
Integrin alpha-V/beta-3
Ligand
BDBM50078710
Substrate
Meas. Tech.
ChEBML_214643
Ki
2±n/a nM
Citation
 Keenan, RMMiller, WHBarton, LSBondinell, WECousins, RDEppley, DFHwang, SMKwon, CLago, MANguyen, TTSmith, BRUzinskas, INYuan, CC Orally bioavailable nonpeptide vitronectin receptor antagonists containing 2-aminopyridine arginine mimetics. Bioorg Med Chem Lett 9:1801-6 (1999)  
Target
Name:
Integrin alpha-V/beta-3
Synonyms:
ITGAV/ITGB3 | Integrin beta-3/Vitronectin receptor alpha
Type:
Enzyme
Mol. Mass.:
Description:
Components:
This complex has 2 components.
Component 1
Name:
Integrin alpha-V
Synonyms:
ITAV_HUMAN Integrin alpha-V/alpha-5 VNRA Vitronectin receptor | Vitronectin receptor subunit alpha
Type:
PROTEIN
Mol. Mass.:
116024.92
Organism:
Homo sapiens (Human)
Description:
ChEMBL_582336
Residue:
1048
  
Component 2
Name:
Integrin beta-3
Synonyms:
CD_antigen=CD61 GPIIIa ITGB3 Platelet membrane glycoprotein IIIa
Type:
Protein
Mol. Mass.:
87038.91
Organism:
Homo sapiens (Human)
Description:
P05106
Residue:
788
  
Inhibitor
Name:
BDBM50078710
Synonyms:
CHEMBL298782 | {(S)-7-[2-(6-Amino-pyridin-2-ylamino)-ethylcarbamoyl]-4-methyl-3-oxo-2,3,4,5-tetrahydro-1H-benzo[e][1,4]diazepin-2-yl}-acetic acid
Type:
Small organic molecule
Emp. Form.:
C20H24N6O4
Mol. Mass.:
412.4424
SMILES:
CN1Cc2cc(ccc2N[C@@H](CC(O)=O)C1=O)C(=O)NCCNc1cccc(N)n1
: