Target
Beta-1 adrenergic receptor
Ligand
BDBM50078799
Substrate
Meas. Tech.
ChEBML_37387
IC50
330±n/a nM
Citation
 Mathvink, RJBarritta, AMCandelore, MRCascieri, MADeng, LTota, LStrader, CDWyvratt, MJFisher, MHWeber, AE Potent, elective human beta3 adrenergic receptor agonists containing a substituted indoline-5-sulfonamide pharmacophore. Bioorg Med Chem Lett 9:1869-74 (1999)  
Target
Name:
Beta-1 adrenergic receptor
Synonyms:
ADRB1 ADRB1_HUMAN Beta-1 adrenoceptor | adrenergic Beta1
Type:
G Protein-Coupled Receptor (GPCR)
Mol. Mass.:
51338.40
Organism:
Homo sapiens (Human)
Description:
P08588
Residue:
477
  
Inhibitor
Name:
BDBM50078799
Synonyms:
1-[5-(3-cyclopentylpropyl)-1,2,4-oxadiazol-3-yl]-N-phenyl-2,3-dihydro-1H-indole-5-sulfonamide | CHEMBL295502
Type:
Small organic molecule
Emp. Form.:
C24H28N4O3S
Mol. Mass.:
452.569
SMILES:
O=S(=O)(Nc1ccccc1)c1ccc2N(CCc2c1)c1noc(CCCC2CCCC2)n1
: