Target
Neutrophil collagenase
Ligand
BDBM50078939
Substrate
Meas. Tech.
ChEMBL_105814 (CHEMBL717814)
Ki
6±n/a nM
Citation
 Vassiliou, SMucha, ACuniasse, PGeorgiadis, DLucet-Levannier, KBeau, FKannan, RMurphy, GKnäuper, VRio, MCBasset, PYiotakis, ADive, V Phosphinic pseudo-tripeptides as potent inhibitors of matrix metalloproteinases: a structure-activity study. J Med Chem 42:2610-20 (1999)  
Target
Name:
Neutrophil collagenase
Synonyms:
CLG1 MMP8 Matrix metalloproteinase-8 PMNL collagenase | PMNL-CL
Type:
Enzyme
Mol. Mass.:
53413.48
Organism:
Homo sapiens (Human)
Description:
P22894
Residue:
467
  
Inhibitor
Name:
BDBM50078939
Synonyms:
(1-Benzyloxycarbonylamino-2-phenyl-ethyl)-{2-[1-carbamoyl-2-(1H-indol-3-yl)-ethylcarbamoyl]-nonyl}-phosphinic acid | CHEMBL432770
Type:
Small organic molecule
Emp. Form.:
C37H47N4O6P
Mol. Mass.:
674.766
SMILES:
CCCCCCCC(CP(O)(=O)C(Cc1ccccc1)NC(=O)OCc1ccccc1)C(=O)NC(Cc1c[nH]c2ccccc12)C(N)=O
: