Target
Adenosine kinase
Ligand
BDBM50524384
Substrate
Meas. Tech.
ChEMBL_1892973 (CHEMBL4394894)
Ki
28±n/a nM
Citation
 Crespo, RADang, QZhou, NEGuthrie, LMSnavely, TCDong, WLoesch, KASuzuki, TYou, LWang, WO'Malley, TParish, TOlsen, DBSacchettini, JC Structure-Guided Drug Design of 6-Substituted Adenosine Analogues as Potent Inhibitors of Mycobacterium tuberculosis Adenosine Kinase. J Med Chem 62:4483-4499 (2019)  
Target
Name:
Adenosine kinase
Synonyms:
2.7.1.20 ADOK_MYCTU adoK | cbhK
Type:
PROTEIN
Mol. Mass.:
34457.04
Organism:
Mycobacterium tuberculosis (strain ATCC 25618 / H37Rv)
Description:
ChEMBL_119021
Residue:
324
  
Inhibitor
Name:
BDBM50524384
Synonyms:
CHEMBL4458246
Type:
Small organic molecule
Emp. Form.:
C27H30N6O3
Mol. Mass.:
486.5655
SMILES:
OC[C@H]1C[C@H]([C@H](O)[C@@H]1O)n1cnc2c(ncnc12)N1CCN(CC1)c1ccc(cc1)-c1ccccc1
: