Target
Integrin alpha-IIb/beta-3
Ligand
BDBM50079442
Substrate
Meas. Tech.
ChEMBL_218214 (CHEMBL824384)
IC50
>10000±n/a nM
Citation
 Dechantsreiter, MAPlanker, EMathä, BLohof, EHölzemann, GJonczyk, AGoodman, SLKessler, H N-Methylated cyclic RGD peptides as highly active and selective alpha(V)beta(3) integrin antagonists. J Med Chem 42:3033-40 (1999)  
Target
Name:
Integrin alpha-IIb/beta-3
Synonyms:
Glycoprotein IIb/IIIa
Type:
Mol. Mass.:
Description:
ASSAY_ID of EBI is 30109
Components:
This complex has 2 components.
Component 1
Name:
Integrin beta-3
Synonyms:
CD_antigen=CD61 GPIIIa ITGB3 Platelet membrane glycoprotein IIIa
Type:
Protein
Mol. Mass.:
87038.91
Organism:
Homo sapiens (Human)
Description:
P05106
Residue:
788
  
Component 2
Name:
Integrin alpha-IIb
Synonyms:
CD_antigen=CD41 GPIIb Glycoprotein IIb ITGA2B Integrin alpha-IIb heavy chain Integrin alpha-IIb light chain, form 2 Integrin alpha-V/beta-3 and alpha-IIb/beta 3 | Platelet membrane glycoprotein IIb
Type:
Protein
Mol. Mass.:
113354.85
Organism:
Homo sapiens (Human)
Description:
P08514
Residue:
1039
  
Inhibitor
Name:
BDBM50079442
Synonyms:
CHEMBL105553 | [(2R,5R,8R,11S)-5-Benzyl-11-(3-guanidino-propyl)-8-isopropyl-13-methyl-3,6,9,12,15-pentaoxo-1,4,7,10,13pentaaza-cyclopentadec-2-yl]-acetic acid
Type:
Small organic molecule
Emp. Form.:
C27H40N8O7
Mol. Mass.:
588.6559
SMILES:
CC(C)[C@H]1NC(=O)[C@@H](Cc2ccccc2)NC(=O)[C@@H](CC(O)=O)NC(=O)CN(C)C(=O)[C@H](CCCNC(N)=N)NC1=O
: