Target
Voltage-dependent L-type calcium channel subunit alpha-1C
Ligand
BDBM50079458
Substrate
Meas. Tech.
ChEMBL_42762 (CHEMBL653732)
Ki
4.1±n/a nM
Citation
 Natale, NRRogers, MEStaples, RTriggle, DJRutledge, A Lipophilic 4-isoxazolyl-1,4-dihydropyridines: synthesis and structure-activity relationships. J Med Chem 42:3087-93 (1999)  
Target
Name:
Voltage-dependent L-type calcium channel subunit alpha-1C
Synonyms:
CAC1C_HUMAN CACN2 CACNL1A1 Calcium channel (Type L) L-type calcium channel alpha-1c/beta-2/alpha2delta-1 Voltage-gated L-type calcium channel Voltage-gated calcium channel | Voltage-gated calcium channel subunit alpha Cav1.2
Type:
Enzyme Catalytic Domain
Mol. Mass.:
248979.79
Organism:
Homo sapiens (Human)
Description:
Calcium channel (Type L) 0 HUMAN::Q13936
Residue:
2221
  
Inhibitor
Name:
BDBM50079458
Synonyms:
2,6-Dimethyl-4-[3-methyl-5-(2-naphthalen-1-yl-ethyl)-isoxazol-4-yl]-1,4-dihydro-pyridine-3,5-dicarboxylic acid diethyl ester | CHEMBL104455
Type:
Small organic molecule
Emp. Form.:
C29H32N2O5
Mol. Mass.:
488.5748
SMILES:
CCOC(=O)C1C(c2c(C)noc2CCc2cccc3ccccc23)C(C(=O)OCC)=C(C)N=C1C
: