Target
Prothrombin
Ligand
BDBM50079489
Substrate
Meas. Tech.
ChEMBL_208546 (CHEMBL814315)
Ki
0.00057±n/a nM
Citation
 Steinmetzer, TZhu, BYKonishi, Y Potent bivalent thrombin inhibitors: replacement of the scissile peptide bond at P(1)-P(1)' with arginyl ketomethylene isosteres. J Med Chem 42:3109-15 (1999)  
Target
Name:
Prothrombin
Synonyms:
Activation peptide fragment 1 Coagulation factor II Prothrombin precursor Thrombin heavy chain | Thrombin light chain
Type:
Protein
Mol. Mass.:
70029.57
Organism:
Homo sapiens (Human)
Description:
P00734
Residue:
622
  
Inhibitor
Name:
BDBM50079489
Synonyms:
Arginyl Ketomethylene analogue | CHEMBL428116
Type:
Small organic molecule
Emp. Form.:
C100H153N25O33
Mol. Mass.:
2233.4325
SMILES:
CC[C@@H](C)[C@H](NC(=O)[C@@H]1CCCN1C(=O)[C@H](CCC(O)=O)NC(=O)[C@H](Cc1ccc(O)cc1)NC(=O)[C@H](CC(O)=O)NC(=O)CNC(=O)[C@H](CC(N)=O)NC(=O)CNC(=O)CNC(=O)CNC(=O)CN[C@@H]1CCCN1CC(=O)[C@H](CCCNC(N)=N)NC(=O)[C@@H]1CCCN1C(=O)[C@H](N)CC1CCCCC1)C(=O)N1CCC[C@H]1C(=O)N[C@@H](CCC(O)=O)C(=O)N[C@@H](CCC(O)=O)C(=O)N[C@@H](C)C(=O)N[C@@H](CC1CCCCC1)C(=O)N[C@H](CCC(O)=O)C(O)=O
: