Target
Acetolactate synthase, chloroplastic
Ligand
BDBM50079605
Substrate
Meas. Tech.
ChEBML_27494
IC50
152000±n/a nM
Comments
modified from >0.000152 20220121
Citation
 Liu, JLi, ZYan, HWang, LChen, J The design and synthesis of ALS inhibitors from pharmacophore models. Bioorg Med Chem Lett 9:1927-32 (1999)  
Target
Name:
Acetolactate synthase, chloroplastic
Synonyms:
AHAS Acetolactate synthase ILVB_ARATH | TZP5
Type:
PROTEIN
Mol. Mass.:
72585.19
Organism:
Arabidopsis thaliana
Description:
ChEMBL_934103
Residue:
670
  
Inhibitor
Name:
BDBM50079605
Synonyms:
4-Fluoro-N-(5-methyl-pyridin-2-yl)-benzenesulfonamide | CHEMBL300583
Type:
Small organic molecule
Emp. Form.:
C12H11FN2O2S
Mol. Mass.:
266.291
SMILES:
Cc1ccc(NS(=O)(=O)c2ccc(F)cc2)nc1
: