Target
Sterol O-acyltransferase 1
Ligand
BDBM50079716
Substrate
Meas. Tech.
ChEMBL_28008 (CHEMBL642891)
IC50
7236±n/a nM
Citation
 Matsuyama, NKosaka, TFukuhara, MSoda, YMizuno, K Polyunsaturated fatty acid anilides as inhibitors of acyl-coA: cholesterol acyltransferase (ACAT). Bioorg Med Chem Lett 9:2039-42 (1999)  
Target
Name:
Sterol O-acyltransferase 1
Synonyms:
ACACT ACAT Acetyl-CoA acetyltransferase, mitochondrial Acyl-CoA: cholesterol acyltransferase (ACAT) Cholesterol acyltransferase 1 SOAT1 STAT
Type:
Multi-pass membrane protein may form homo- or heterodimers.
Mol. Mass.:
64751.94
Organism:
Homo sapiens (Human)
Description:
P35610
Residue:
550
  
Inhibitor
Name:
BDBM50079716
Synonyms:
(5E,8E,11E,14E,17E,20E)-Docosa-5,8,11,14,17,20-hexaenoic acid (2,6-diisopropyl-phenyl)-amide | CHEMBL304267
Type:
Small organic molecule
Emp. Form.:
C34H49NO
Mol. Mass.:
487.759
SMILES:
C\C=C\C\C=C\C\C=C\C\C=C\C\C=C\C\C=C\CCCC(=O)Nc1c(cccc1C(C)C)C(C)C
: