Target
Protein phosphatase 3 catalytic subunit alpha
Ligand
BDBM50079777
Substrate
Meas. Tech.
ChEBML_42586
IC50
15±n/a nM
Citation
 Armstrong, HMWong, FHolmes, MASinclair, PJGoulet, MTDumont, FJStaruch, MJKoprak, SPeterson, LBRosa, RWilusz, MBWiederrecht, GJCryan, JGWyvratt, MJParsons, WH Potent immunosuppressive C32-O-arylethyl ether derivatives of ascomycin with reduced toxicity. Bioorg Med Chem Lett 9:2089-94 (1999)  
Target
Name:
Protein phosphatase 3 catalytic subunit alpha
Synonyms:
CALNA PP2BA_HUMAN Serine/threonine protein phosphatase 2B catalytic subunit, alpha isoform calcineurin
Type:
Enzyme Catalytic Domain
Mol. Mass.:
58681.14
Organism:
Homo sapiens (Human)
Description:
calcineurin 0 HUMAN::Q08209
Residue:
521
  
Inhibitor
Name:
BDBM50079777
Synonyms:
(E)-(1R,9S,12S,13R,14R,21S,23S,24R,25S,27R)-17-Allyl-1,14-dihydroxy-12-[(E)-2-((3R,4R)-4-hydroxy-3-methoxy-cyclohexyl)-1-methyl-vinyl]-23,25-dimethoxy-13,19,21,27-tetramethyl-11,28-dioxa-4-aza-tricyclo[22.3.1.0*4,9*]octacos-18-ene-2,3,10,16-tetraone FK-506 Prograf Tacrolimus
Type:
Small organic molecule
Emp. Form.:
C44H69NO12
Mol. Mass.:
804.0182
SMILES:
[H][C@]12O[C@](O)([C@H](C)C[C@@H]1OC)C(=O)C(=O)N1CCCC[C@@]1([H])C(=O)O[C@@H]([C@H](C)[C@@H](O)CC(=O)[C@H](CC=C)\C=C(C)\C[C@H](C)C[C@@H]2OC)C(\C)=C\[C@@H]1CC[C@@H](O)[C@@H](C1)OC
: