Target
D(1A) dopamine receptor
Ligand
BDBM50079939
Substrate
Meas. Tech.
ChEMBL_60501 (CHEMBL673330)
Ki
>1000±n/a nM
Citation
 Birch, AMBradley, PAGill, JCKerrigan, FNeedham, PL N-Substituted (2,3-dihydro-1,4-benzodioxin-2-yl)methylamine derivatives as D(2) antagonists/5-HT(1A) partial agonists with potential as atypical antipsychotic agents. J Med Chem 42:3342-55 (1999)  
Target
Name:
D(1A) dopamine receptor
Synonyms:
DA D1 receptor DRD1 Dopamine D1 receptor Dopamine D1A
Type:
Enzyme
Mol. Mass.:
49303.43
Organism:
Homo sapiens (Human)
Description:
P21728
Residue:
446
  
Inhibitor
Name:
BDBM50079939
Synonyms:
(7-Chloro-2,3-dihydro-benzo[1,4]dioxin-2-ylmethyl)-[1-(2-methoxy-phenyl)-piperidin-4-ylmethyl]-amine | CHEMBL418854
Type:
Small organic molecule
Emp. Form.:
C22H27ClN2O3
Mol. Mass.:
402.914
SMILES:
COc1ccccc1N1CCC(CNCC2COc3ccc(Cl)cc3O2)CC1
: