Target
Metabotropic glutamate receptor 2
Ligand
BDBM50080059
Substrate
Meas. Tech.
ChEMBL_218872 (CHEMBL820029)
IC50
2550±n/a nM
Citation
 Kolczewski, SAdam, GStadler, HMutel, VWichmann, JWoltering, T Synthesis of heterocyclic enol ethers and their use as group 2 metabotropic glutamate receptor antagonists. Bioorg Med Chem Lett 9:2173-6 (1999)  
Target
Name:
Metabotropic glutamate receptor 2
Synonyms:
GPRC1B GRM2_HUMAN Metabotropic glutamate receptor mGlu2 | metabotropic glutamate 2
Type:
Enzyme
Mol. Mass.:
95584.88
Organism:
Homo sapiens (Human)
Description:
Q14416
Residue:
872
  
Inhibitor
Name:
BDBM50080059
Synonyms:
1-[(Z)-2-Cyclopentyloxy-2-(2,4-dichloro-phenyl)-vinyl]-1H-[1,2,4]triazole | CHEMBL305799
Type:
Small organic molecule
Emp. Form.:
C15H15Cl2N3O
Mol. Mass.:
324.205
SMILES:
Clc1ccc(\C(OC2CCCC2)=C\n2cncn2)c(Cl)c1
: