Target
Delta-type opioid receptor
Ligand
BDBM50080455
Substrate
Meas. Tech.
ChEMBL_146907 (CHEMBL751120)
Ki
61±n/a nM
Citation
 Schiller, PWFundytus, MEMerovitz, LWeltrowska, GNguyen, TMLemieux, CChung, NNCoderre, TJ The opioid mu agonist/delta antagonist DIPP-NH(2)[Psi] produces a potent analgesic effect, no physical dependence, and less tolerance than morphine in rats. J Med Chem 42:3520-6 (1999)  
Target
Name:
Delta-type opioid receptor
Synonyms:
Cytochrome P450 3A4 Delta opioid receptor Delta-type opioid receptor (DOR) OPRD_RAT Opioid receptor Opioid receptors; mu & delta Ror-a | Voltage-gated potassium channel
Type:
G Protein-Coupled Receptor (GPCR)
Mol. Mass.:
40465.04
Organism:
Rattus norvegicus (rat)
Description:
Competition binding assays were using CHO-K1 cell membranes expressing the opioid receptor.
Residue:
372
  
Inhibitor
Name:
BDBM50080455
Synonyms:
(S)-N-((S)-1-Carbamoyl-2-phenyl-ethyl)-2-({2-[(S)-3-(4-hydroxy-2,6-dimethyl-phenyl)-2-methylamino-propionyl]-1,2,3,4-tetrahydro-isoquinolin-3-ylmethyl}-amino)-3-phenyl-propionamide | CHEMBL119535
Type:
Small organic molecule
Emp. Form.:
C40H47N5O4
Mol. Mass.:
661.8323
SMILES:
CN[C@@H](Cc1c(C)cc(O)cc1C)C(=O)N1Cc2ccccc2CC1CN[C@@H](Cc1ccccc1)C(=O)N[C@@H](Cc1ccccc1)C(N)=O
: