Target
5-hydroxytryptamine receptor 1D
Ligand
BDBM50080890
Substrate
Meas. Tech.
ChEBML_1681
EC50
0.500000±n/a nM
Citation
 Russell, MGBeer, MSStanton, JASohal, BMortishire-Smith, RJCastro, JL 2,7-diazabicyclo[3.3.0]octanes as novel h5-HT receptor agonists. Bioorg Med Chem Lett 9:2491-6 (1999)  
Target
Name:
5-hydroxytryptamine receptor 1D
Synonyms:
5-HT-1D 5-HT1D 5HT1D_HUMAN HTR1DA Serotonin (5-HT) receptor | Serotonin Receptor 1D
Type:
G Protein-Coupled Receptor (GPCR)
Mol. Mass.:
41920.63
Organism:
Homo sapiens (Human)
Description:
Receptor binding assays were performed using human clone stably expressed in CHO cells.
Residue:
377
  
Inhibitor
Name:
BDBM50080890
Synonyms:
3-((2R,3aR,6aR)-5-Benzyl-1-methyl-octahydro-pyrrolo[3,4-b]pyrrol-2-ylmethyl)-5-[1,2,4]triazol-4-yl-1H-indole | CHEMBL83426
Type:
Small organic molecule
Emp. Form.:
C25H28N6
Mol. Mass.:
412.53
SMILES:
CN1[C@@H](Cc2c[nH]c3ccc(cc23)-n2cnnc2)C[C@@H]2CN(Cc3ccccc3)C[C@H]12
: