Target
Plasminogen
Ligand
BDBM50081087
Substrate
Meas. Tech.
ChEBML_155068
IC50
>2500±n/a nM
Citation
 Tamura, SYGoldman, EABergum, PWSemple, JE Novel benzo-fused lactam scaffolds as factor Xa inhibitors. Bioorg Med Chem Lett 9:2573-8 (1999)  
Target
Name:
Plasminogen
Synonyms:
Activation peptide PLG Plasmin Plasmin heavy chain A, short form | Plasmin light chain B
Type:
Enzyme
Mol. Mass.:
90579.18
Organism:
Homo sapiens (Human)
Description:
Residue:
810
  
Inhibitor
Name:
BDBM50081087
Synonyms:
CHEMBL87947 | N-((S)-1-Carbamimidoyl-2-hydroxy-piperidin-3-yl)-2-((S)-7-methoxy-2-oxo-3-phenylmethanesulfonylamino-2,3,4,5-tetrahydro-benzo[b]azepin-1-yl)-acetamide; TFA
Type:
Small organic molecule
Emp. Form.:
C26H34N6O6S
Mol. Mass.:
558.65
SMILES:
COc1ccc2N(CC(=O)N[C@H]3CCCN(C3O)C(N)=N)C(=O)[C@H](CCc2c1)NS(=O)(=O)Cc1ccccc1
: