Target
Peroxisome proliferator-activated receptor delta
Ligand
BDBM50081225
Substrate
Meas. Tech.
ChEMBL_153723 (CHEMBL762051)
EC50
3100±n/a nM
Citation
 Brown, PJWinegar, DAPlunket, KDMoore, LBLewis, MCWilson, JGSundseth, SSKoble, CSWu, ZChapman, JMLehmann, JMKliewer, SAWillson, TM A ureido-thioisobutyric acid (GW9578) is a subtype-selective PPARalpha agonist with potent lipid-lowering activity. J Med Chem 42:3785-8 (1999)  
Target
Name:
Peroxisome proliferator-activated receptor delta
Synonyms:
NR1C2 NUCI Nuclear receptor subfamily 1 group C member 2 PPAR-beta PPARD Peroxisome proliferator-activated receptor Peroxisome proliferator-activated receptor delta
Type:
Enzyme
Mol. Mass.:
49910.45
Organism:
Homo sapiens (Human)
Description:
Q03181
Residue:
441
  
Inhibitor
Name:
BDBM50081225
Synonyms:
2-(4-{2-[3-(4-Fluoro-phenyl)-1-heptyl-ureido]-ethyl}-phenoxy)-2-methyl-propionic acid | CHEMBL340011
Type:
Small organic molecule
Emp. Form.:
C26H35FN2O4
Mol. Mass.:
458.5655
SMILES:
CCCCCCCN(CCc1ccc(OC(C)(C)C(O)=O)cc1)C(=O)Nc1ccc(F)cc1
: