Target
Receptor-type tyrosine-protein kinase FLT3
Ligand
BDBM50526216
Substrate
Meas. Tech.
ChEMBL_1899286 (CHEMBL4401401)
Ki
2.0±n/a nM
Citation
 Bensinger, DStubba, DCremer, AKohl, VWaßmer, TStuckert, JEngemann, VStegmaier, KSchmitz, KSchmidt, B Virtual Screening Identifies Irreversible FMS-like Tyrosine Kinase 3 Inhibitors with Activity toward Resistance-Conferring Mutations. J Med Chem 62:2428-2446 (2019)  
Target
Name:
Receptor-type tyrosine-protein kinase FLT3
Synonyms:
CD135 FL cytokine receptor FLK2 FLT3 Fetal liver kinase-2 Fms-like tyrosine kinase 3 (Flt-3) STK-1 Stem cell tyrosine kinase 1
Type:
Enzyme
Mol. Mass.:
112888.62
Organism:
Homo sapiens (Human)
Description:
P36888
Residue:
993
  
Inhibitor
Name:
BDBM50526216
Synonyms:
CHEMBL4553725
Type:
Small organic molecule
Emp. Form.:
C24H31N5O4S
Mol. Mass.:
485.599
SMILES:
CCN(CC)CCNC(=O)c1c(C)[nH]c(\C=C2/C(=O)Nc3ccc(NS(=O)(=O)C=C)cc23)c1C
: