Target
Dipeptidase 1
Ligand
BDBM50042568
Substrate
Meas. Tech.
ChEBML_53274
Ki
480000±n/a nM
Citation
 Toney, JHCleary, KAHammond, GGYuan, XMay, WJHutchins, SMAshton, WTVanderwall, DE Structure-activity relationships of biphenyl tetrazoles as metallo-beta-lactamase inhibitors. Bioorg Med Chem Lett 9:2741-6 (1999)  
Target
Name:
Dipeptidase 1
Synonyms:
DPEP1 Dipeptidase 1 Microsomal dipeptidase Renal dipeptidase
Type:
Enzyme Catalytic Domain
Mol. Mass.:
44697.32
Organism:
GUINEA PIG
Description:
Leukotriene D4 Alpha 0 GUINEA PIG::P22412
Residue:
409
  
Inhibitor
Name:
BDBM50042568
Synonyms:
5-Butyl-2-(2,4-dichloro-phenyl)-4-[2'-(1H-tetrazol-5-yl)-biphenyl-4-ylmethyl]-2H-pyrazole-3-carboxylic acid ethyl ester | CHEMBL327837
Type:
Small organic molecule
Emp. Form.:
C30H28Cl2N6O2
Mol. Mass.:
575.488
SMILES:
CCCCc1nn(c(C(=O)OCC)c1Cc1ccc(cc1)-c1ccccc1-c1nnn[nH]1)-c1ccc(Cl)cc1Cl
: