Target
Tissue-type plasminogen activator
Ligand
BDBM14059
Substrate
Meas. Tech.
ChEBML_208048
Ki
360±n/a nM
Citation
 Becker, MREwing, WRDavis, RSPauls, HWLy, CLi, AMason, HJChoi-Sledeski, YMSpada, APChu, VBrown, KDColussi, DJLeadley, RJBentley, RBostwick, JKasiewski, CMorgan, S Synthesis, SAR and in vivo activity of novel thienopyridine sulfonamide pyrrolidinones as factor Xa inhibitors. Bioorg Med Chem Lett 9:2753-8 (1999)  
Target
Name:
Tissue-type plasminogen activator
Synonyms:
Alteplase Reteplase Thrombin receptor protein Tissue-type plasminogen activator (tPA) t-PA t-plasminogen activator
Type:
Enzyme
Mol. Mass.:
62931.08
Organism:
Homo sapiens (Human)
Description:
Residue:
562
  
Inhibitor
Name:
BDBM14059
Synonyms:
4-hydroxy-3-[[(3S)-2-oxo-3-(9-thia-5-azabicyclo[4.3.0]nona-2,4,7,10-tetraen-8-ylsulfonylamino)pyrrolidin-1-yl]methyl]benzenecarboximidamide CHEMBL330572 | RPR131247
Type:
Small organic molecule
Emp. Form.:
C19H19N5O4S2
Mol. Mass.:
445.515
SMILES:
NC(=N)c1ccc(O)c(CN2CC[C@H](NS(=O)(=O)c3cc4ncccc4s3)C2=O)c1
: