Target
Tissue-type plasminogen activator
Ligand
BDBM50081512
Substrate
Meas. Tech.
ChEBML_208048
Ki
8700±n/a nM
Citation
 Becker, MREwing, WRDavis, RSPauls, HWLy, CLi, AMason, HJChoi-Sledeski, YMSpada, APChu, VBrown, KDColussi, DJLeadley, RJBentley, RBostwick, JKasiewski, CMorgan, S Synthesis, SAR and in vivo activity of novel thienopyridine sulfonamide pyrrolidinones as factor Xa inhibitors. Bioorg Med Chem Lett 9:2753-8 (1999)  
Target
Name:
Tissue-type plasminogen activator
Synonyms:
Alteplase Reteplase Thrombin receptor protein Tissue-type plasminogen activator (tPA) t-PA t-plasminogen activator
Type:
Enzyme
Mol. Mass.:
62931.08
Organism:
Homo sapiens (Human)
Description:
Residue:
562
  
Inhibitor
Name:
BDBM50081512
Synonyms:
3-[(S)-3-(4-Chloro-thieno[3,2-c]pyridine-2-sulfonylamino)-2-oxo-pyrrolidin-1-ylmethyl]-4-hydroxy-benzamidine | CHEMBL328893
Type:
Small organic molecule
Emp. Form.:
C19H18ClN5O4S2
Mol. Mass.:
479.96
SMILES:
NC(=N)c1ccc(O)c(CN2CC[C@H](NS(=O)(=O)c3cc4c(Cl)nccc4s3)C2=O)c1
: