Target
Dihydrofolate reductase
Ligand
BDBM50081909
Substrate
Meas. Tech.
ChEMBL_55095 (CHEMBL665356)
Ki
65±n/a nM
Citation
 Chowdhury, SFVillamor, VBGuerrero, RHLeal, IBrun, RCroft, SLGoodman, JMMaes, LRuiz-Perez, LMPacanowska, DGGilbert, IH Design, synthesis, and evaluation of inhibitors of trypanosomal and leishmanial dihydrofolate reductase. J Med Chem 42:4300-12 (1999)  
Target
Name:
Dihydrofolate reductase
Synonyms:
DHFR Dihydrofolate reductase (DHFR) | Tetrahydrofolate dehydrogenase
Type:
Enzyme
Mol. Mass.:
21453.99
Organism:
Homo sapiens (Human)
Description:
Recombinant human DHFR.
Residue:
187
  
Inhibitor
Name:
BDBM50081909
Synonyms:
5-(3-(benzyloxy)benzyl)pyrimidine-2,4-diamine CHEMBL274031
Type:
Small organic molecule
Emp. Form.:
C18H18N4O
Mol. Mass.:
306.3617
SMILES:
Nc1ncc(Cc2cccc(OCc3ccccc3)c2)c(N)n1
: