Target
Dihydrofolate reductase
Ligand
BDBM18512
Substrate
Meas. Tech.
ChEMBL_54288 (CHEMBL666807)
Ki
120±n/a nM
Citation
 Chowdhury, SFVillamor, VBGuerrero, RHLeal, IBrun, RCroft, SLGoodman, JMMaes, LRuiz-Perez, LMPacanowska, DGGilbert, IH Design, synthesis, and evaluation of inhibitors of trypanosomal and leishmanial dihydrofolate reductase. J Med Chem 42:4300-12 (1999)  
Target
Name:
Dihydrofolate reductase
Synonyms:
DHFR Dihydrofolate reductase (DHFR) | Tetrahydrofolate dehydrogenase
Type:
Enzyme
Mol. Mass.:
21453.99
Organism:
Homo sapiens (Human)
Description:
Recombinant human DHFR.
Residue:
187
  
Inhibitor
Name:
BDBM18512
Synonyms:
5-(4-chlorophenyl)-6-ethylpyrimidine-2,4-diamine Pyrimethamine (Pyr) cid_4993
Type:
Small organic molecule
Emp. Form.:
C12H13ClN4
Mol. Mass.:
248.711
SMILES:
CCc1nc(N)nc(N)c1-c1ccc(Cl)cc1
: