Target
Dihydrofolate reductase
Ligand
BDBM50081915
Substrate
Meas. Tech.
ChEMBL_55095 (CHEMBL665356)
Ki
93±n/a nM
Citation
 Chowdhury, SFVillamor, VBGuerrero, RHLeal, IBrun, RCroft, SLGoodman, JMMaes, LRuiz-Perez, LMPacanowska, DGGilbert, IH Design, synthesis, and evaluation of inhibitors of trypanosomal and leishmanial dihydrofolate reductase. J Med Chem 42:4300-12 (1999)  
Target
Name:
Dihydrofolate reductase
Synonyms:
DHFR Dihydrofolate reductase (DHFR) | Tetrahydrofolate dehydrogenase
Type:
Enzyme
Mol. Mass.:
21453.99
Organism:
Homo sapiens (Human)
Description:
Recombinant human DHFR.
Residue:
187
  
Inhibitor
Name:
BDBM50081915
Synonyms:
5-[3-(Tetrahydro-pyran-2-yloxy)-benzyl]-pyrimidine-2,4-diamine | CHEMBL344592
Type:
Small organic molecule
Emp. Form.:
C16H20N4O2
Mol. Mass.:
300.3556
SMILES:
Nc1ncc(Cc2cccc(OC3CCCCO3)c2)c(N)n1
: