Target
Dihydrofolate reductase
Ligand
BDBM50081910
Substrate
Meas. Tech.
ChEMBL_53497 (CHEMBL665621)
Ki
24±n/a nM
Citation
 Chowdhury, SFVillamor, VBGuerrero, RHLeal, IBrun, RCroft, SLGoodman, JMMaes, LRuiz-Perez, LMPacanowska, DGGilbert, IH Design, synthesis, and evaluation of inhibitors of trypanosomal and leishmanial dihydrofolate reductase. J Med Chem 42:4300-12 (1999)  
Target
Name:
Dihydrofolate reductase
Synonyms:
DHFR Dihydrofolate reductase (DHFR) | Tetrahydrofolate dehydrogenase
Type:
Enzyme
Mol. Mass.:
21453.99
Organism:
Homo sapiens (Human)
Description:
Recombinant human DHFR.
Residue:
187
  
Inhibitor
Name:
BDBM50081910
Synonyms:
5-(3-Octyloxy-benzyl)-pyrimidine-2,4-diamine | CHEMBL31235
Type:
Small organic molecule
Emp. Form.:
C19H28N4O
Mol. Mass.:
328.4518
SMILES:
CCCCCCCCOc1cccc(Cc2cnc(N)nc2N)c1
: