Target
Anionic trypsin
Ligand
BDBM50082194
Substrate
Meas. Tech.
ChEBML_212167
Ki
110±n/a nM
Citation
 Stürzebecher, JVieweg, HSteinmetzer, TSchweinitz, AStubbs, MTRenatus, MWikström, P 3-Amidinophenylalanine-based inhibitors of urokinase. Bioorg Med Chem Lett 9:3147-52 (1999)  
Target
Name:
Anionic trypsin
Synonyms:
Anionic trypsin Trypsin II
Type:
PROTEIN
Mol. Mass.:
26281.39
Organism:
Bos taurus
Description:
ChEMBL_212177
Residue:
247
  
Inhibitor
Name:
BDBM50082194
Synonyms:
4-[3-(3-Carbamimidoyl-phenyl)-2-(2,4,6-triisopropyl-benzenesulfonylamino)-propionyl]-piperazine-1-carboxylic acid methyl ester | CHEMBL326866
Type:
Small organic molecule
Emp. Form.:
C31H45N5O5S
Mol. Mass.:
599.785
SMILES:
COC(=O)N1CCN(CC1)C(=O)C(Cc1cccc(c1)C(N)=N)NS(=O)(=O)c1c(cc(cc1C(C)C)C(C)C)C(C)C
: