Target
Urokinase-type plasminogen activator
Ligand
BDBM23891
Substrate
Meas. Tech.
ChEBML_155744
Ki
410±n/a nM
Citation
 Stürzebecher, JVieweg, HSteinmetzer, TSchweinitz, AStubbs, MTRenatus, MWikström, P 3-Amidinophenylalanine-based inhibitors of urokinase. Bioorg Med Chem Lett 9:3147-52 (1999)  
Target
Name:
Urokinase-type plasminogen activator
Synonyms:
PLAU UROK_HUMAN Urokinase-type plasminogen activator (uPA) | Urokinase-type plasminogen activator/surface receptor
Type:
Enzyme
Mol. Mass.:
48528.62
Organism:
Homo sapiens (Human)
Description:
P00749
Residue:
431
  
Inhibitor
Name:
BDBM23891
Synonyms:
3-amidinophenylalanine deriv., 35 ethyl 4-[(2S)-3-(3-carbamimidoylphenyl)-2-{[2,4,6-tris(propan-2-yl)benzene]sulfonamido}propanoyl]piperazine-1-carboxylate
Type:
Small organic molecule
Emp. Form.:
C32H47N5O5S
Mol. Mass.:
613.811
SMILES:
CCOC(=O)N1CCN(CC1)C(=O)[C@H](Cc1cccc(c1)C(N)=N)NS(=O)(=O)c1c(cc(cc1C(C)C)C(C)C)C(C)C
: