Target
Free fatty acid receptor 3
Ligand
BDBM50527466
Substrate
Meas. Tech.
ChEMBL_1902642 (CHEMBL4404864)
EC50
1202±n/a nM
Citation
 Ulven, ERQuon, TSergeev, EBarki, NBrvar, MHudson, BDDutta, PHansen, AHBielefeldt, LŲTobin, ABMcKenzie, CJMilligan, GUlven, T Structure-Activity Relationship Studies of Tetrahydroquinolone Free Fatty Acid Receptor 3 Modulators. J Med Chem 63:3577-3595 (2020)  
Target
Name:
Free fatty acid receptor 3
Synonyms:
FFAR3 GPR41
Type:
PROTEIN
Mol. Mass.:
38655.15
Organism:
Homo sapiens (Human)
Description:
ChEMBL_1508992
Residue:
346
  
Inhibitor
Name:
BDBM50527466
Synonyms:
CHEMBL4570341
Type:
Small organic molecule
Emp. Form.:
C22H22N2O2S
Mol. Mass.:
378.487
SMILES:
CC1=C(C(c2cccs2)C2=C(CCCC2=O)N1)C(=O)Nc1ccccc1C
: