Target
Tyrosine-protein kinase ZAP-70
Ligand
BDBM5097
Substrate
Meas. Tech.
ChEBML_217767
IC50
6000±n/a nM
Citation
 Vu, CBCorpuz, EGPradeepan, SGViolette, SBartlett, CSawyer, TK Nonpeptidic SH2 inhibitors of the tyrosine kinase ZAP-70. Bioorg Med Chem Lett 9:3009-14 (1999)  
Target
Name:
Tyrosine-protein kinase ZAP-70
Synonyms:
70 kDa zeta-associated protein Syk-related tyrosine kinase Tyrosine-protein kinase ZAP-70 Tyrosine-protein kinase ZAP-70 (ZAP70) ZAP70 Zeta-chain (TCR) associated protein kinase 70kDa
Type:
Enzyme
Mol. Mass.:
69881.61
Organism:
Homo sapiens (Human)
Description:
ZAP-70 SH2 domain was expressed and purified from E. coli using O-phospho-L-tyrosine-agarose column.
Residue:
619
  
Inhibitor
Name:
BDBM5097
Synonyms:
1,2,4-Oxadiazole Analogue 5f CHEMBL103838
Type:
Small organic molecule
Emp. Form.:
C23H24F3N4O7P
Mol. Mass.:
556.4282
SMILES:
C[C@H](NC(=O)[C@H](Cc1ccc(OP(O)(O)=O)cc1)NC(C)=O)c1nc(Cc2ccc(cc2)C(F)(F)F)no1
: