Target
Tyrosine-protein kinase JAK2
Ligand
BDBM264212
Substrate
Meas. Tech.
ChEMBL_1904021 (CHEMBL4406243)
IC50
>15000±n/a nM
Target
Name:
Tyrosine-protein kinase JAK2
Synonyms:
JAK-2 JAK2_HUMAN Janus kinase 2 (JAK2) | Janus kinase 2 (a protein tyrosine kinase)
Type:
Protein
Mol. Mass.:
130684.68
Organism:
Homo sapiens (Human)
Description:
O60674
Residue:
1132
  
Inhibitor
Name:
BDBM264212
Synonyms:
(2R)-N-(3-{2-[(3- methoxy-1-methyl- 1H-pyrazol-4-yl)amino] pyrimidin-4- yl}-1H-indol-7-yl)-2-(4- methylpiperazin-1- yl)propanamide US10654835, Example 32 US20230416237, Example AZD4205 | US9714236, 32
Type:
Small organic molecule
Emp. Form.:
C25H31N9O2
Mol. Mass.:
489.5727
SMILES:
COc1nn(C)cc1Nc1nccc(n1)-c1c[nH]c2c(NC(=O)[C@@H](C)N3CCN(C)CC3)cccc12
: