Target
Beta-2 adrenergic receptor
Ligand
BDBM50116766
Substrate
Meas. Tech.
ChEMBL_1904397 (CHEMBL4406619)
Ki
>10000±n/a nM
Citation
 Moritz, AEFree, RBWeiner, WSAkano, EOGandhi, DAbramyan, AKeck, TMFerrer, MHu, XSouthall, NSteiner, JAubé, JShi, LFrankowski, KJSibley, DR Discovery, Optimization, and Characterization of ML417: A Novel and Highly Selective D J Med Chem 63:5526-5567 (2020)  
Target
Name:
Beta-2 adrenergic receptor
Synonyms:
ADRB2 ADRB2_HUMAN Beta-2 adrenoceptor | Beta-2 adrenoreceptor
Type:
Mol. Mass.:
46461.69
Organism:
Homo sapiens (Human)
Description:
P07550
Residue:
413
  
Inhibitor
Name:
BDBM50116766
Synonyms:
(-)-Pramipexole 2,6-Benzothiazolediamine, 4,5,6,7-tetrahydro-N(sup 6)-propyl-, (S)- PRAMIPEXOLE | cid_119570
Type:
Small organic molecule
Emp. Form.:
C10H17N3S
Mol. Mass.:
211.327
SMILES:
CCCN[C@H]1CCc2nc(N)sc2C1
: