Target
Alpha-1D adrenergic receptor
Ligand
BDBM50082808
Substrate
Meas. Tech.
ChEMBL_32452 (CHEMBL643400)
Ki
640±n/a nM
Citation
 Murali Dhar, TGNagarathnam, DMarzabadi, MRLagu, BWong, WCChiu, GTyagarajan, SMiao, SWZhang, FSun, WTian, DShen, QZhang, JWetzel, JMForray, CChang, RSBroten, TPSchorn, TWChen, TBO'Malley, SRansom, RSchneck, KBendesky, RHarrell, CMVyas, KP Design and synthesis of novel alpha(1)(a) adrenoceptor-selective antagonists. 2. Approaches to eliminate opioid agonist metabolites via modification of linker and 4-methoxycarbonyl-4-phenylpiperidine moiety. J Med Chem 42:4778-93 (1999)  
Target
Name:
Alpha-1D adrenergic receptor
Synonyms:
ADA1D_HUMAN ADRA1D Adrenergic receptor alpha Alpha 1D-adrenoreceptor Alpha-1D adrenoceptor adrenergic Alpha1D
Type:
Enzyme Catalytic Domain
Mol. Mass.:
60485.82
Organism:
Homo sapiens (Human)
Description:
adrenergic Alpha1D ADRA1D HUMAN::P25100
Residue:
572
  
Inhibitor
Name:
BDBM50082808
Synonyms:
4-(3,4-Difluoro-phenyl)-6-methoxymethyl-3-[3-(4-methyl-4-phenyl-piperidin-1-yl)-propylcarbamoyl]-2-oxo-1,2,3,4-tetrahydro-pyrimidine-5-carboxylic acid methyl ester | CHEMBL142243
Type:
Small organic molecule
Emp. Form.:
C30H36F2N4O5
Mol. Mass.:
570.6274
SMILES:
COCC1=C(C(N(C(=O)NCCCN2CCC(C)(CC2)c2ccccc2)C(=O)N1)c1ccc(F)c(F)c1)C(=O)OC
: