Target
Alpha-1A adrenergic receptor
Ligand
BDBM50082838
Substrate
Meas. Tech.
ChEMBL_33741 (CHEMBL647056)
Ki
430±n/a nM
Citation
 Lagu, BTian, DNagarathnam, DMarzabadi, MRWong, WCMiao, SWZhang, FSun, WChiu, GFang, JForray, CChang, RSRansom, RWChen, TBO'Malley, SZhang, KVyas, KPGluchowski, C Design and synthesis of novel alpha(1)(a) adrenoceptor-selective antagonists. 3. Approaches to eliminate opioid agonist metabolites by using substituted phenylpiperazine side chains. J Med Chem 42:4794-803 (1999)  
Target
Name:
Alpha-1A adrenergic receptor
Synonyms:
ADA1A_HUMAN ADRA1C Alpha 1A-adrenoceptor Alpha adrenergic receptor 1a Alpha-adrenergic receptor 1c adrenergic Alpha1 | adrenergic Alpha1C
Type:
Cell-surface receptors
Mol. Mass.:
51511.67
Organism:
Homo sapiens (Human)
Description:
P35348
Residue:
466
  
Inhibitor
Name:
BDBM50082838
Synonyms:
3-{3-[4-(4-Acetyl-phenyl)-piperazin-1-yl]-propylcarbamoyl}-4-(3,4-difluoro-phenyl)-6-methyl-2-oxo-1,2,3,4-tetrahydro-pyrimidine-5-carboxylic acid methyl ester | CHEMBL145122
Type:
Small organic molecule
Emp. Form.:
C29H33F2N5O5
Mol. Mass.:
569.5996
SMILES:
COC(=O)C1=C(C)NC(=O)N(C1c1ccc(F)c(F)c1)C(=O)NCCCN1CCN(CC1)c1ccc(cc1)C(C)=O
: