Target
Alpha-1B adrenergic receptor
Ligand
BDBM50082854
Substrate
Meas. Tech.
ChEMBL_34459 (CHEMBL651991)
Ki
150±n/a nM
Citation
 Lagu, BTian, DNagarathnam, DMarzabadi, MRWong, WCMiao, SWZhang, FSun, WChiu, GFang, JForray, CChang, RSRansom, RWChen, TBO'Malley, SZhang, KVyas, KPGluchowski, C Design and synthesis of novel alpha(1)(a) adrenoceptor-selective antagonists. 3. Approaches to eliminate opioid agonist metabolites by using substituted phenylpiperazine side chains. J Med Chem 42:4794-803 (1999)  
Target
Name:
Alpha-1B adrenergic receptor
Synonyms:
ADA1B_HUMAN Adrenergic alpha1B Adrenergic receptor alpha Alpha 1B-adrenoreceptor | Alpha-1B adrenergic receptor
Type:
Enzyme
Mol. Mass.:
56862.13
Organism:
Homo sapiens (Human)
Description:
P35368
Residue:
520
  
Inhibitor
Name:
BDBM50082854
Synonyms:
4-(3,4-Difluoro-phenyl)-6-methyl-3-{3-[4-(3-nitro-phenyl)-piperazin-1-yl]-propylcarbamoyl}-2-oxo-1,2,3,4-tetrahydro-pyrimidine-5-carboxylic acid methyl ester | CHEMBL359433
Type:
Small organic molecule
Emp. Form.:
C27H30F2N6O6
Mol. Mass.:
572.5605
SMILES:
COC(=O)C1=C(C)NC(=O)N(C1c1ccc(F)c(F)c1)C(=O)NCCCN1CCN(CC1)c1cccc(c1)[N+]([O-])=O
: