Target
Alpha-1B adrenergic receptor
Ligand
BDBM50082862
Substrate
Meas. Tech.
ChEMBL_34459 (CHEMBL651991)
Ki
220±n/a nM
Citation
 Lagu, BTian, DNagarathnam, DMarzabadi, MRWong, WCMiao, SWZhang, FSun, WChiu, GFang, JForray, CChang, RSRansom, RWChen, TBO'Malley, SZhang, KVyas, KPGluchowski, C Design and synthesis of novel alpha(1)(a) adrenoceptor-selective antagonists. 3. Approaches to eliminate opioid agonist metabolites by using substituted phenylpiperazine side chains. J Med Chem 42:4794-803 (1999)  
Target
Name:
Alpha-1B adrenergic receptor
Synonyms:
ADA1B_HUMAN Adrenergic alpha1B Adrenergic receptor alpha Alpha 1B-adrenoreceptor | Alpha-1B adrenergic receptor
Type:
Enzyme
Mol. Mass.:
56862.13
Organism:
Homo sapiens (Human)
Description:
P35368
Residue:
520
  
Inhibitor
Name:
BDBM50082862
Synonyms:
5-Acetyl-4-methyl-2-oxo-6-(3,4,5-trifluoro-phenyl)-3,6-dihydro-2H-pyrimidine-1-carboxylic acid {3-[4-(2-carbamoyl-phenyl)-piperazin-1-yl]-propyl}-amide | CHEMBL358795
Type:
Small organic molecule
Emp. Form.:
C28H31F3N6O4
Mol. Mass.:
572.5787
SMILES:
CC(=O)C1=C(C)NC(=O)N(C1c1cc(F)c(F)c(F)c1)C(=O)NCCCN1CCN(CC1)c1ccccc1C(N)=O
: