Target
Interstitial collagenase
Ligand
BDBM50082980
Substrate
Meas. Tech.
ChEMBL_105968 (CHEMBL715380)
IC50
1.5±n/a nM
Citation
 Barlaam, BBird, TGLambert-Van Der Brempt, CCampbell, DFoster, SJMaciewicz, R New alpha-substituted succinate-based hydroxamic acids as TNFalpha convertase inhibitors. J Med Chem 42:4890-908 (1999)  
Target
Name:
Interstitial collagenase
Synonyms:
CLG MMP1 Matrix metalloproteinase-1 | Matrix metalloproteinase-1 (MMP-1)
Type:
Enzyme
Mol. Mass.:
54010.26
Organism:
Homo sapiens (Human)
Description:
P03956
Residue:
469
  
Inhibitor
Name:
BDBM50082980
Synonyms:
(2R,3S)-2-(Benzenesulfonyl-methyl-amino)-N*4*-((S)-2,2-dimethyl-1-methylcarbamoyl-propyl)-N*1*-hydroxy-3-isobutyl-succinamide | CHEMBL344060
Type:
Small organic molecule
Emp. Form.:
C22H36N4O6S
Mol. Mass.:
484.609
SMILES:
CNC(=O)[C@@H](NC(=O)[C@H](CC(C)C)[C@H](N(C)S(=O)(=O)c1ccccc1)C(=O)NO)C(C)(C)C
: