Target
Integrin alpha-V/beta-3
Ligand
BDBM50083788
Substrate
Meas. Tech.
ChEMBL_214637 (CHEMBL819717)
IC50
7.1±n/a nM
Citation
 Pitts, WJWityak, JSmallheer, JMTobin, AEJetter, JWBuynitsky, JSHarlow, PPSolomon, KACorjay, MHMousa, SAWexler, RRJadhav, PK Isoxazolines as potent antagonists of the integrin alpha(v)beta(3). J Med Chem 43:27-40 (2000)  
Target
Name:
Integrin alpha-V/beta-3
Synonyms:
ITGAV/ITGB3 | Integrin beta-3/Vitronectin receptor alpha
Type:
Enzyme
Mol. Mass.:
Description:
Components:
This complex has 2 components.
Component 1
Name:
Integrin alpha-V
Synonyms:
ITAV_HUMAN Integrin alpha-V/alpha-5 VNRA Vitronectin receptor | Vitronectin receptor subunit alpha
Type:
PROTEIN
Mol. Mass.:
116024.92
Organism:
Homo sapiens (Human)
Description:
ChEMBL_582336
Residue:
1048
  
Component 2
Name:
Integrin beta-3
Synonyms:
CD_antigen=CD61 GPIIIa ITGB3 Platelet membrane glycoprotein IIIa
Type:
Protein
Mol. Mass.:
87038.91
Organism:
Homo sapiens (Human)
Description:
P05106
Residue:
788
  
Inhibitor
Name:
BDBM50083788
Synonyms:
2-(2-Chloro-6-methyl-benzenesulfonylamino)-3-({5-[4-(1H-imidazol-2-ylamino)-butyl]-4,5-dihydro-isoxazole-3-carbonyl}-amino)-propionic acid | CHEMBL128250
Type:
Small organic molecule
Emp. Form.:
C21H27ClN6O6S
Mol. Mass.:
526.994
SMILES:
Cc1cccc(Cl)c1S(=O)(=O)N[C@@H](CNC(=O)C1=NOC(CCCCNc2ncc[nH]2)C1)C(O)=O
: