Target
Coagulation factor X
Ligand
BDBM50084163
Substrate
Meas. Tech.
ChEMBL_49303 (CHEMBL661584)
Ki
5.2±n/a nM
Citation
 Guilford, WJShaw, KJDallas, JLKoovakkat, SLee, WLiang, ALight, DRMcCarrick, MAWhitlow, MYe, BMorrissey, MM Synthesis, characterization, and structure-activity relationships of amidine-substituted (bis)benzylidene-cycloketone olefin isomers as potent and selective factor Xa inhibitors. J Med Chem 42:5415-25 (2000)  
Target
Name:
Coagulation factor X
Synonyms:
Activated coagulation factor X (FXa) Coagulation factor X precursor F10 Factor X heavy chain Factor Xa Stuart-Prower factor
Type:
Enzyme
Mol. Mass.:
54726.60
Organism:
Homo sapiens (Human)
Description:
Residue:
488
  
Inhibitor
Name:
BDBM50084163
Synonyms:
2,6-di[1-[4-amino(imino)methylphenyl]-(Z)-methylidene]-4-phenyl-1-cyclohexanone | CHEMBL358180
Type:
Small organic molecule
Emp. Form.:
C28H26N4O
Mol. Mass.:
434.5322
SMILES:
NC(=N)c1ccc(\C=C2\CC(C\C(=C\c3ccc(cc3)C(N)=N)C2=O)c2ccccc2)cc1
: