Target
D(2) dopamine receptor
Ligand
BDBM50084485
Substrate
Meas. Tech.
ChEMBL_61627 (CHEMBL673083)
Ki
3400±n/a nM
Citation
 Perrone, RBerardi, FColabufo, NALeopoldo, MTortorella, V A structure-affinity relationship study on derivatives of N-[2-[4-(4-Chlorophenyl)piperazin-1-yl]ethyl]-3-methoxybenzamide, a high-affinity and selective D(4) receptor ligand. J Med Chem 43:270-7 (2000)  
Target
Name:
D(2) dopamine receptor
Synonyms:
D(2) dopamine receptor DOPAMINE D2 Long DRD2 Dopamine D2 receptor Dopamine D2 receptor (D2R) Dopamine2-like | d2
Type:
Cell-surface receptors
Mol. Mass.:
50647.10
Organism:
Homo sapiens (Human)
Description:
P14416
Residue:
443
  
Inhibitor
Name:
BDBM50084485
Synonyms:
1-(4-Chloro-phenyl)-4-[3-(5-methoxy-1,2,3,4-tetrahydro-naphthalen-1-yl)-propyl]-piperazine (2HCL) | CHEMBL321557
Type:
Small organic molecule
Emp. Form.:
C24H31ClN2O
Mol. Mass.:
398.969
SMILES:
COc1cccc2C(CCCN3CCN(CC3)c3ccc(Cl)cc3)CCCc12
: