Target
Adenosine receptor A1
Ligand
BDBM50084860
Substrate
Meas. Tech.
ChEMBL_28999 (CHEMBL643474)
Ki
900±n/a nM
Citation
 Sauer, RMaurinsh, JReith, UFülle, FKlotz, KNMüller, CE Water-soluble phosphate prodrugs of 1-propargyl-8-styrylxanthine derivatives, A(2A)-selective adenosine receptor antagonists. J Med Chem 43:440-8 (2000)  
Target
Name:
Adenosine receptor A1
Synonyms:
AA1R_RAT ADENOSINE A1 high Adenosine A1 receptor (A1) Adenosine receptors A1 | Adora1
Type:
Protein
Mol. Mass.:
36704.13
Organism:
Rattus norvegicus (rat)
Description:
Residue:
326
  
Inhibitor
Name:
BDBM50084860
Synonyms:
3-(3-Hydroxy-propyl)-8-[2-(3-methoxy-phenyl)-vinyl]-7-methyl-1-prop-2-ynyl-3,7-dihydro-purine-2,6-dione(MSX-2) | CHEMBL413079
Type:
Small organic molecule
Emp. Form.:
C21H22N4O4
Mol. Mass.:
394.4238
SMILES:
COc1cccc(\C=C\c2nc3n(CCCO)c(=O)n(CC#C)c(=O)c3n2C)c1
: