Target
Peroxisome proliferator-activated receptor gamma
Ligand
BDBM50085043
Substrate
Meas. Tech.
ChEMBL_88436 (CHEMBL701905)
EC50
66.0±n/a nM
Citation
 Willson, TMBrown, PJSternbach, DDHenke, BR The PPARs: from orphan receptors to drug discovery. J Med Chem 43:527-50 (2000)  
Target
Name:
Peroxisome proliferator-activated receptor gamma
Synonyms:
NR1C3 PPAR-gamma PPARG_HUMAN Peroxisome proliferator-activated receptor gamma (PPAR gamma) Peroxisome proliferator-activated receptor gamma (PPARĪ³) peroxisome proliferator-activated receptor gamma isoform 2
Type:
Nuclear Receptor
Mol. Mass.:
57613.46
Organism:
Homo sapiens (Human)
Description:
P37231
Residue:
505
  
Inhibitor
Name:
BDBM50085043
Synonyms:
3-{4-[2-(Benzooxazol-2-yl-methyl-amino)-ethoxy]-phenyl}-2-ethoxy-propionic acid CHEMBL306229 | SB-213068
Type:
Small organic molecule
Emp. Form.:
C21H24N2O5
Mol. Mass.:
384.4257
SMILES:
CCOC(Cc1ccc(OCCN(C)c2nc3ccccc3o2)cc1)C(O)=O
: