Target
Peroxisome proliferator-activated receptor delta
Ligand
BDBM50075315
Substrate
Meas. Tech.
ChEMBL_139147 (CHEMBL747680)
EC50
7200±n/a nM
Citation
 Willson, TMBrown, PJSternbach, DDHenke, BR The PPARs: from orphan receptors to drug discovery. J Med Chem 43:527-50 (2000)  
Target
Name:
Peroxisome proliferator-activated receptor delta
Synonyms:
NUC1 Nuclear hormone receptor 1 PPAR-beta PPARD_MOUSE Ppard
Type:
PROTEIN
Mol. Mass.:
49719.14
Organism:
Mus musculus
Description:
ChEMBL_1288931
Residue:
440
  
Inhibitor
Name:
BDBM50075315
Synonyms:
5-(2,4-Dioxo-thiazolidin-5-ylmethyl)-2-methoxy-N-(4-trifluoromethyl-benzyl)-benzamide CHEMBL24458 | KRP-297
Type:
Small organic molecule
Emp. Form.:
C20H17F3N2O4S
Mol. Mass.:
438.42
SMILES:
COc1ccc(Cc2sc(=O)[nH]c2O)cc1C(=O)NCc1ccc(cc1)C(F)(F)F
: