Target
Peroxisome proliferator-activated receptor alpha
Ligand
BDBM28799
Substrate
Meas. Tech.
ChEMBL_139142 (CHEMBL743989)
EC50
5±n/a nM
Citation
 Willson, TMBrown, PJSternbach, DDHenke, BR The PPARs: from orphan receptors to drug discovery. J Med Chem 43:527-50 (2000)  
Target
Name:
Peroxisome proliferator-activated receptor alpha
Synonyms:
Nr1c1 PPAR-alpha Peroxisome Proliferator-Activated Receptor alpha Ppara
Type:
PROTEIN
Mol. Mass.:
52343.28
Organism:
Mus musculus
Description:
ChEMBL_572395
Residue:
468
  
Inhibitor
Name:
BDBM28799
Synonyms:
2-{[4-(2-{[(2,4-difluorophenyl)carbamoyl](heptyl)amino}ethyl)phenyl]sulfanyl}-2-methylpropanoic acid GW 9578 GW9578
Type:
Small organic molecule
Emp. Form.:
C26H34F2N2O3S
Mol. Mass.:
492.622
SMILES:
CCCCCCCN(CCc1ccc(SC(C)(C)C(O)=O)cc1)C(=O)Nc1ccc(F)cc1F
: